原先vs2012程序运行项目是可以了,不会出现程序包Dsp.Bds.dll还原失败,找不到版本未2.0.1.0的程序包问题, 但是项目可以正常运行,每次调试看到下面一片红感觉不舒服 原因:可能当时我看到vs2012中有更新,我点击了visual studio包更新,导致跟项目程序的包版本不一致,引发错误 解决方法: 将vs2012编辑器进行重置配置环境 “Microsoft Visual Studio 2012"->"Visual Studio Tools"->&…
安装完成Scrapy时候,终端导入Scrapy时候,发现没有任何报错,但是在运行Scrapy的项目的时候提示“import win32api ImportError: DLL load failed: 找不到指定的模块”,发现我们的win32api模块没有安装,此时我们通过pip install pypiwin32 安装该模块发现模块已经在本地安装过,但是就是无法导入 win32api: 解决办法: 直接下载win32api 模块进行安装,便可以安装成功: https://sourceforge…
运行几年前做的项目,发现各种编译报错,一个一个解决记录下: 1.Xcode(Xcode9)编译运行报错,但是在 issue navigatior 栏看不到错误信息: 解决方案:在 show report navigator 栏查看编译错误信息: Showing All Messages The operation couldn’t be completed. Unable to log in with account '**@**.com'. (The login details for acc…
项目 XXX 的 NuGet 程序包还原失败:找不到“xxx”版本的程序包“xxx” 编译新下载的代码出错 修改包管理器的源为 http://www.nuget.org/api/v2/ .重试后成功 记得打勾 其实我的默认就是这个地址,我也不知道为什么没打勾,我到这里打上勾就好了…
项目   Web 的 NuGet 程序包还原失败: 找不到“1.0.0”版本的程序包“Microsoft.Net.Compilers”.. 0 使用vs的NutGet包管理器时,另一台电脑从svn下载代码后出现的错误,修改包管理器的源为 http://www.nuget.org/api/v2/ .重试后成功…
问题:     首先出现这个bug的是在我的vs2017社区版的ide上,这两天使用了出现了一个非常神奇的问题,就是我程序中的nuget包总提示找不到源文件,并且我点击Nuget还原的话还一直提示着一个问题. 严重性 代码 说明 项目 文件 行 禁止显示状态错误 项目 JJHL.WEB 的 NuGet 包还原失败: 找不到“11.0.2”版本的程序包“Newtonsoft.Json”. C:\Program Files (x86)\Microsoft SDKs\NuGetPackages\: 在…
1.安装zip yum install -y unzip zip 2.安装lrszs yum -y install lrzsz 3.安装scp 遇到下面的问题: 结果提示: No package scp available. 解决办法: scp这东西应该属于openssh-clients:直接运行安装yum install openssh-clients 4.yum安装wegt yum -y install wget 5.yum安装vim yum  install vim 安装过程中报错: Fi…
原先本地项目版本(4.0.0.1)高于服务器版本(4.0.0.0),本地项目改成服务器版本4.0.0.0时,发布后的项目报这个错误…
---恢复内容开始--- 1. Undefined symbols for architecture i386: "_deflate", referenced from: -[NSData(AMapCloudCompression) maZlibDeflate] in AMapCloudKit -[NSData(AMapCloudCompression) maGZipDeflate] in AMapCloudKit -[NSData(MACompression) maZlibDefla…
netbeans运行项目时,弹出“cannot be run from folder that contains non-ASCII characters in path”的对话框,原因是项目路径中有中文的. 解决方法是:把项目移动另外一下全英文路径中…
docker打包镜像遇到一个因为nuget权限验证问题导致镜像打包失败的问题,公司Nuget包用的是tfs管理的,tfs有权限验证,结果导致nuget还原失败,原有的NuGet.config文件如下: <?xml version="1.0" encoding="utf-8"?> <configuration> <solution> <add key="disableSourceControlIntegration&…
最近再看java,却被一个看似很基础的hellorworld头疼了十几分钟,百度了一下,若你在cmd下编辑及运行.java文件时报错,解决方案如下,如图所示:…
最近在做项目的时候需要操作ftp进行文件的上传下载,但在调用using (var response = (FtpWebResponse)FtpWebRequest.GetResponse())的时候总是出现"远程服务器返回错误:(550)文件不可用(例如,未找到文件,无法访问文件)"的异常.在网上也没有找到好的解决方案,于是自己研究了下给解决了,分享给大家,希望对大家能有所帮助. 异常信息 这种情况是因为FTP设置的默认目录引发的,以我现在的项目为例,在程序中我要访问的路径为 ftp:…
图1 图2 问题原因:导致该问题的原因就是打包的时候,同时将 spring-context 和 spring-aop包提取到了我们的程序应用的包中,在package过程中,这2个依赖包的 XML schema  重名了,到aop将context的 spring.schemas覆盖了,这样在进行spring加载配置文件过程中,context找不到约束文件来进行比对. 修复方法:1.如果只是简单的ioc的应用,移除aop包的依赖,在打包成artifact的时候,设置不提取aop到应用中. 2.使用m…
今天连接mysql数据库报错如下: java.sql.SQLException: The server time zone value '�й���׼ʱ��' is unrecognized or represents more than one time zone. You must configure either the server or JDBC driver (via the serverTimezone configuration property) to use a more s…
有时候在window8以上系统中对C#系统进行调试 提示不能使用32位IIS Express,如果每次都采用IIS 在vs代码进行调试的时候很麻烦 下面我们就介绍一下怎么用编译调试64位代码: 网上方法一: 使用Visual Studio 2012开发网站或web应用程序时,可以使用两种web server.自带的development server和IIS EXPRESS.development server是x86版本的,IIS EXPRESS是同时x86和x64版. 然而在引用64位dll…
之前遇到过相同的问题,总是记吃不记打,踩过的坑后面还会踩进去... 仅以次标记加深一下印象 错误特征RT 确认该类型错误是library或frameWork的search路径问题 首先找到编译错误的路径  从上图选中的openQQ为例 修改方案步骤如下 找到对应的路径 删掉试试,如果还不行再重新导入一下就好了…
1. 程序源代码报错部分: #选择年级if grade == '幼升小': outline.nianji().pop(0).click()elif grade == "一年级": outline.nianji().pop(1).click() # 一年级elif grade == "二年级": outline.nianji().pop(2).click() # 二年级elif grade == "三年级": outline.nianji().po…
错误:Cannot run program "E:\Program Files\Git\bin\git.exe":CreateProcess error=2,系统找不到指定的文件 解决方法: 1.首先要保证电脑上已经安装了git 2.Ctl+Alt+S…
在react-native run-android  时 可能出现压缩包不成功的情况,原因是压缩包失败,需要手动解压到相应目录, 目录:C:\Users\Administrator\.gradle\wrapper\dists gradle-2.14.1-all.zip 下载链接: https://pan.baidu.com/s/1i5XlwSP 密码: 7fca…
发现问题 切换到mac平台后,突然想写点程序运行在mac下,想到mac自带java,会方便好多.不过在这过程中遇到了麻烦: 总是提示 “错误: 找不到或无法加载主类” 工程结构 查了好久,终于找到原型所在,发现网上很多资料都写的都不太多,自己记录一下.先看看工程的位置和目录. 我的eclipse 工作空间位置是: /Users/zhangyunfei/workspace_java 我的工程名字叫:hellodemo 我的main class 的package name (包名)为: hellod…
项目中使用的是wepy框架开发的小程序,,, 使用场景是,用户点击下载图片的时候,要调起授权button(小程序拉起授权的功能都集成在了button组件,所以这里需要用到button组件里的一个open-type属性,属性值为'openSetting'和一个绑定事件bindopensetting联合使用)来进行授权, 具体代码如下: <button id="download" class="bottomButton" @tap="downloadBu…
前段时间开发了一款微信小程序,运行了也几个月了,在index.js中的onLoad生命周期里获取app.js中onLaunch生命周期中在接口里动态设置的globalData一直没有问题,结果昨天就获取不到动态设置的global数据了.因为我要获取小程序的unionid以及通过unionid去获取微信的openId,并且共享数据,最开始我是通过storage来做数据共享的,后来测试发现storage存在莫名被清空的情况,后来转用globalData来做数据共享,查了下,是因为app.js中的on…
出现该错误是因为jar包版本不匹配,比如linux上的jar包导入到windows上了.可以将.m2\repository的org.apache.maven.plugins删掉然后让maven重新下载试试. .m2文件夹的位置可以在eclipse的jar包中查到,打开maven dependencies即可看到jar包所在的.m2文件夹位置.…
点击工具栏的Project->Properties->Java Build Path->Libraries-> 双击第一项 点击Add添加允许javafx 然后就不会报错了…
1.pip install --upgrade setuptools #安装或升级 2.如果是基于numpy的python 包,升级numpy pip install -U numpy 3.重新pip install gensim 即可. pip install tensorflow也类似.…
kafaka版本:kafka_2.11-1.1.0原因有2个:1  目录不能有空格   D:\Soft\kafka_2.11-1.1.0 , 放在Program Files目录中一直有问题2  修改D:\Soft\kafka_2.11-1.1.0\bin\windows\kafka-run-class.bat 文件179行 set COMMAND=%JAVA% %KAFKA_HEAP_OPTS% %KAFKA_JVM_PERFORMANCE_OPTS% %KAFKA_JMX_OPTS% %KAF…
报错内容: java.sql.SQLException: The server time zone value '�й���׼ʱ��' is unrecognized or represents more than one time zone. You must configure either the server or JDBC driver (via the serverTimezone configuration property) to use a more specifc time…
出错提示如下: ERROR Failed to compile with errors :: error in ./src/App.vue Module build failed: Error: No parser and no file path given, couldn't infer a p arser. at normalize (D:\works\:) at formatWithCursor (D:\works\:) at D:\works\node_modules\prettier…
安装opencv后,运行一个测试程序提示"from .cv2 import *: DLL load failed: 找不到指定的模块".于是百度一下解决办法,结果试了N多方法后也没能解决这个问题. 最后不得不耐心的下载了dependency walker来查看opencv到底是缺少了哪个dll文件.(dependency walker这个软件还是很有用的,如果试了好多方法没有解决安装问题,可以下载下来试试.运行后,单击 file->open->"D:\python…